{"text_format":"1","workbook":"xlsx","n_sheets":4,"sheets":["Anleitung","via Kaufpreis","via Einkommen","Matrix"],"not_rendered":{"charts":0,"images":1,"macros":1,"external_links":0,"defined_names":0,"comments":0,"pivot_tables":0},"unopened":[],"bounds":{"document_bytes":16777216,"sheet_cells":100000,"rows_first":2000,"rows_last":500,"rows_between":2000,"halvings":0,"cell_chars":16384,"cell_head_chars":4096},"cells_cut":0,"cells_raw":0,"read":"whole","date_system":"1900"}

{"sheet":"Anleitung","index":0,"n_rows":25,"n_cols":1,"rows_kept":25,"cut":false,"hidden":false,"merged":[]}
["Anleitung zur Benutzung der Rechner (Privatkundenfokus)"]
[]
["1. Berechnung via Kaufpreis"]
[]
["Bei diesem Rechner ist der Kaufpreis des Wunschobjekts bekannt."]
[]
["In den Eingabefeldern (Blau) können die verschiedenen Werte erfasst werden. "]
["In den grünen Feldern werden dann die Resultate der Berechnung ausgegeben."]
[]
["Unter Punkt 2 sieht man die entsprechenden Kreditsummen je nach Eingabe unter Punkt 1"]
["Unter Punkt 3 werden die Zinskosten berechnet welche über den Berechnungszeitraum anfallen, (mit und ohne CHW Anteil) sowie die Differenz zu einer 100% CHF Finanzierung ausgezeigt."]
["Unter Punkt 4 wird das für die Finanzierung notwendige Einkommen berechnet. Mit und ohne CHW-Anteil bei der Finanzierung (kalkulatorisch)"]
[]
[]
["2. Berechnung via Einkommen"]
[]
["Bei diesem Rechner ist das Einkommen und die verfügbaren Eigenmittel bekannt und das Ergebniss ist der kalkulatorisch maximal mögliche Kaufpreis."]
["Die Berechnung erfolgt auf Basis kalkulatorischer Werte und in Schritten von CHF 10 000.-."]
[]
["In den Eingabefeldern (Blau) können die verschiedenen Werte erfasst werden. "]
["In den grünen Feldern werden dann die Resultate der Berechnung ausgegeben."]
[]
["Unter Punkt 2 werden die kalkulatorisch maximalen Kaufpreise mit und ohne WIR-Anteil bei der Finanzierung angegeben."]
["Es wird der tiefste kalkulierte Wert ausgegeben (abhängig von Eigenmitteln und verfügbarem Einkommen)."]
["Die Berechnung funktioniert bis zu einem maximalen Kaufpreis von CHF 4 Mio."]

{"sheet":"via Kaufpreis","index":1,"n_rows":45,"n_cols":12,"rows_kept":45,"cut":false,"hidden":false,"merged":[[0,0,0,1],[0,2,0,4],[7,4,7,6],[44,1,44,7]]}
[{"$error":"#VALUE!"},null,"Rechner\nImmobilienfinanzierung mit der Bank WIR"]
[]
["Wieviel Zinsen kann ich sparen bei einer Teilfinanzierung mit CHW?"]
["Wie beeinflusst eine Teilfinanzierung in CHW meine Tragbarkeitsrechnung?"]
[]
[null,"Eingabefelder:"]
[null,"Kaufpreis Liegenschaft in CHF:",1000000,null,null,null,null,null,null,"Hilfszahlen Amo für Tragbarkeit",null,{"$f":"IF(C18/C7<0.66,\"0\",(C18-(C7*66%))/15)","v":9333.3333333333339}]
[null,"Eigenmittel in CHF:",200000,null,{"$f":"IF(C8>=K10,\"OK\",L10)","v":"OK"},null,null,null,null,"Kalk Zinssatz:",4.5,"%"]
[null,"möglicher Anteil in WIR in %:",0,"%",null,null,null,null,null,"Kalk Zinssatz WIR:",1.75,"% (Cap)"]
[null,null,null,null,null,null,null,null,null,"EM Warnung",{"$f":"C7*0.2","v":200000},"Eigenmittel unter 20% des Kaufpreises"]
[null,"Berechnungszeitraum:",10,"Jahre"]
[]
[null,"Angenommener Zinssatz für CHF:",2.5,"%"]
[null,"Angenommener Zinssatz für CHW:",1.25,"%"]
[]
[]
[null,"Kreditsummen:"]
[null,"Kredithöhe Total in CHF/CHW",{"$f":"C7-C8","v":800000}]
[null,"davon "]
[null,"Anteil in CHF",{"$f":"C18-C21","v":800000},"CHF"]
[null,"Anteil in CHW",{"$f":"C18*C9/100","v":0},"CHW"]
[]
[]
[null,"Zinskosten für den gesamten Berechnungszeitraum:"]
[null,"Zinskosten Total mit CHW-Anteil",{"$f":"((C20*C13/100)+(C21*C14/100))*C11","v":200000},null,"Differenz Total",null,"Differenz p.a."]
[]
[null,"Zinskosten bei 100% CHF",{"$f":"(C18*C13/100)*C11","v":200000},null,{"$f":"C27-C25","v":0},null,{"$f":"(C27-C25)/C11","v":0}]
[]
[]
[null,"notwendiges Einkommen (kalkulatorisch)"]
[null," mit CHW-Anteil",{"$f":"((C7*0.7/100)+(L7)+(C20*K8/100)+(C21*K9/100))/35*100","v":149523.80952380953}]
[]
[null," bei 100% CHF",{"$f":"((C7*0.7/100)+L7+(C18*K8/100))/35*100","v":149523.80952380953}]
[]
[]
[]
[null,"Berechnungsgrundlagen:"]
[null,"Kalkulatorischer CHF Zinssatz für Tragbarkeit: 4.5%"]
[null,"Kalkulatorischer CHW Zinssatz für Tragbarkeit: 1.75% (Cap)"]
[null,"Unterhaltskosten: 0.7% vom Kaufpreis"]
{"$rows_left_out":6}
{"sheet":"via Einkommen","index":2,"n_rows":30,"n_cols":16,"rows_kept":30,"cut":false,"hidden":false,"merged":[[0,0,0,1],[0,2,0,4],[29,1,29,7]]}
[{"$error":"#VALUE!"},null,"Rechner\nImmobilienfinanzierung mit der Bank WIR"]
[]
["Wie hoch kann der maximale Kaufpreis sein, bei definiertem Einkommen und Eigenmittel?"]
["Wie beeinflusst eine Teilfinanzierung in CHW den maximalen Kaufpreis?"]
[null,null,null,null,null,null,null,null,null,null,null,null,null,null,"max Kaufpreis (EK)","Kalk. Kosten max."]
[null,"Eingabefelder:",null,null,null,null,null,null,null,null,null,null,null,null,{"$f":"C8/0.2","v":1000000},0.35]
[null,"verfügbares Einkommen",150000]
[null,"verfügbare Eigenmittel in CHF:",200000,null,null,null,null,null,null,null,null,null,null,null,"max Kaufpreis (Einkommen)"]
[null,"möglicher Anteil in WIR in %:",0,"%",null,null,null,null,null,null,null,null,null,null,{"$f":"_xlfn.XLOOKUP(\"OK\",Matrix!I1:I401,Matrix!A1:A401,0,0,1)","v":1000000}]
[]
[null,null,null,null,null,null,null,null,null,null,null,null,null,null,"max Kaufpreis (Einkommen) mit WIR"]
[null,"Maximaler Kaufpreis",null,null,null,null,null,null,null,null,null,null,null,null,{"$f":"_xlfn.XLOOKUP(\"OK\",Matrix!O4:O404,Matrix!A4:A404,0,0,1)","v":1000000}]
[null,"bei 100% CHF",{"$f":"MIN(O9,O6)","v":1000000}]
[]
[null,"mit WIR-Anteil",{"$f":"MIN(O6,O12)","v":1000000}]
[]
[]
[]
[null,"Berechnungsgrundlagen:"]
[null,"Kalkulatorischer CHF Zinssatz für Tragbarkeit: 4.5%"]
[null,"Kalkulatorischer CHW Zinssatz für Tragbarkeit: 1.75% (Cap)"]
[null,"Unterhaltskosten: 0.7% vom Kaufpreis"]
[null,"Tragbarkeitsrechnung: max. 35% des Einkommens"]
[null,"Amortisation bei mehr als 66% Belehnung und übersteigender Anteil in 15 Jahren zurück geführt."]
[null,"Eigenmittel begrenzen max. Kaufpreis (mindestens 20% Eigenkaital)"]
[null,"Resultate in CHF 10 000er Schritten (funktioniert bis Kaufpreise von 4 Mio. CHF)"]
[]
[]
[null,"Disclaimer"]
[null,"Die Nutzung des Hypothekenrechners sowie die daraus folgenden Berechnungsergebnisse sind weder für bestehende noch für potenzielle Kunden der Bank WIR bestimmt. Die Berechnungen dienen ausschliesslich als rein informative und unverbindliche Beispiele basierend auf Annahmen und Richtwerten des Benutzers und sind nicht Bestandteil allfälliger Beratungsleistungen. Sie stellen keine Empfehlung durch die Bank WIR dar. Die Bank WIR übernimmt keine Verantwortung für die Richtigkeit und Vollständigkeit der Angaben und Berechnungsergebnisse im Hypothekenrechner. Sämtliche im Zusammenhang mit den Berechnungsergebnissen getätigten Dispositionen erfolgen auf eigenes Risiko. Jegliche Haftung von der Bank WIR für Schäden, die sich aus der Benützung oder durch den Zugriff auf den Hypothekenrechner oder deren Berechnungsergebnisse ergeben sollten, ist ausgeschlossen."]

{"sheet":"Matrix","index":3,"n_rows":401,"n_cols":15,"rows_kept":401,"cut":false,"hidden":true,"merged":[]}
["Kaufpreis","Kredithöhe","Belehnung","Zinskosten","Ammo","Unterhalt","kalk. Kosten","max. Anteil Einkommen","Check","Kredithöhe CHF","Kredithöhe WIR","Zinskosten CHF II","Zinskosten WIR","kalk. Kosten mit WIR","Check WIR"]
[4000000,{"$f":"A2-'via Einkommen'!$C$8","v":3800000},{"$f":"B2/A2","v":0.95},{"$f":"0.045*B2","v":171000},{"$f":"IF(C2<0.66,\"0\",(B2-(A2*0.66))/15)","v":77333.333333333328},{"$f":"0.007*A2","v":28000},{"$f":"SUM(D2:F2)","v":276333.33333333331},{"$f":"+'via Einkommen'!$C$7*'via Einkommen'!$P$6","v":52500},{"$f":"IF(H2>G2,\"OK\",\"NOK\")","v":"NOK"},{"$f":"A2-'via Einkommen'!$C$8-K2","v":3800000},{"$f":"A2/100*'via Einkommen'!$C$9","v":0},{"$f":"0.045*J2","v":171000},{"$f":"0.0175*K2","v":0},{"$f":"L2+M2+E2+F2","v":276333.33333333331},{"$f":"IF(H2>N2,\"OK\",\"NOK\")","v":"NOK"}]
[{"$f":"A2-10000","v":3990000},{"$f":"A3-'via Einkommen'!$C$8","v":3790000},{"$f":"B3/A3","v":0.94987468671679198},{"$f":"0.045*B3","v":170550},{"$f":"IF(C3<0.66,\"0\",(B3-(A3*0.66))/15)","v":77106.666666666672},{"$f":"0.007*A3","v":27930},{"$f":"SUM(D3:F3)","v":275586.66666666669},{"$f":"+'via Einkommen'!$C$7*'via Einkommen'!$P$6","v":52500},{"$f":"IF(H3>G3,\"OK\",\"NOK\")","v":"NOK"},{"$f":"A3-'via Einkommen'!$C$8-K3","v":3790000},{"$f":"A3/100*'via Einkommen'!$C$9","v":0},{"$f":"0.045*J3","v":170550},{"$f":"0.0175*K3","v":0},{"$f":"L3+M3+E3+F3","v":275586.66666666669},{"$f":"IF(H3>N3,\"OK\",\"NOK\")","v":"NOK"}]
[{"$f":"A3-10000","v":3980000},{"$f":"A4-'via Einkommen'!$C$8","v":3780000},{"$f":"B4/A4","v":0.94974874371859297},{"$f":"0.045*B4","v":170100},{"$f":"IF(C4<0.66,\"0\",(B4-(A4*0.66))/15)","v":76880},{"$f":"0.007*A4","v":27860},{"$f":"SUM(D4:F4)","v":274840},{"$f":"+'via Einkommen'!$C$7*'via Einkommen'!$P$6","v":52500},{"$f":"IF(H4>G4,\"OK\",\"NOK\")","v":"NOK"},{"$f":"A4-'via Einkommen'!$C$8-K4","v":3780000},{"$f":"A4/100*'via Einkommen'!$C$9","v":0},170100,0,274840,"NOK"]
[3970000,{"$f":"A5-'via Einkommen'!$C$8","v":3770000},0.94962216624685136,169650,76653.333333333328,27790,274093.33333333331,{"$f":"+'via Einkommen'!$C$7*'via Einkommen'!$P$6","v":52500},"NOK",{"$f":"A5-'via Einkommen'!$C$8-K5","v":3770000},{"$f":"A5/100*'via Einkommen'!$C$9","v":0},169650,0,274093.33333333331,"NOK"]
[3960000,{"$f":"A6-'via Einkommen'!$C$8","v":3760000},0.9494949494949495,169200,76426.666666666672,27720,273346.66666666669,{"$f":"+'via Einkommen'!$C$7*'via Einkommen'!$P$6","v":52500},"NOK",{"$f":"A6-'via Einkommen'!$C$8-K6","v":3760000},{"$f":"A6/100*'via Einkommen'!$C$9","v":0},169200,0,273346.66666666669,"NOK"]
[3950000,{"$f":"A7-'via Einkommen'!$C$8","v":3750000},0.94936708860759489,168750,76200,27650,272600,{"$f":"+'via Einkommen'!$C$7*'via Einkommen'!$P$6","v":52500},"NOK",{"$f":"A7-'via Einkommen'!$C$8-K7","v":3750000},{"$f":"A7/100*'via Einkommen'!$C$9","v":0},168750,0,272600,"NOK"]
[3940000,{"$f":"A8-'via Einkommen'!$C$8","v":3740000},0.949238578680203,168300,75973.333333333328,27580,271853.33333333331,{"$f":"+'via Einkommen'!$C$7*'via Einkommen'!$P$6","v":52500},"NOK",{"$f":"A8-'via Einkommen'!$C$8-K8","v":3740000},{"$f":"A8/100*'via Einkommen'!$C$9","v":0},168300,0,271853.33333333331,"NOK"]
[3930000,{"$f":"A9-'via Einkommen'!$C$8","v":3730000},0.94910941475826971,167850,75746.666666666672,27510,271106.66666666669,{"$f":"+'via Einkommen'!$C$7*'via Einkommen'!$P$6","v":52500},"NOK",{"$f":"A9-'via Einkommen'!$C$8-K9","v":3730000},{"$f":"A9/100*'via Einkommen'!$C$9","v":0},167850,0,271106.66666666669,"NOK"]
[3920000,{"$f":"A10-'via Einkommen'!$C$8","v":3720000},0.94897959183673475,167400,75520,27440,270360,{"$f":"+'via Einkommen'!$C$7*'via Einkommen'!$P$6","v":52500},"NOK",{"$f":"A10-'via Einkommen'!$C$8-K10","v":3720000},{"$f":"A10/100*'via Einkommen'!$C$9","v":0},167400,0,270360,"NOK"]
[3910000,{"$f":"A11-'via Einkommen'!$C$8","v":3710000},0.94884910485933505,166950,75293.333333333328,27370,269613.33333333331,{"$f":"+'via Einkommen'!$C$7*'via Einkommen'!$P$6","v":52500},"NOK",{"$f":"A11-'via Einkommen'!$C$8-K11","v":3710000},{"$f":"A11/100*'via Einkommen'!$C$9","v":0},166950,0,269613.33333333331,"NOK"]
[3900000,{"$f":"A12-'via Einkommen'!$C$8","v":3700000},0.94871794871794868,166500,75066.666666666672,27300,268866.66666666669,{"$f":"+'via Einkommen'!$C$7*'via Einkommen'!$P$6","v":52500},"NOK",{"$f":"A12-'via Einkommen'!$C$8-K12","v":3700000},{"$f":"A12/100*'via Einkommen'!$C$9","v":0},166500,0,268866.66666666669,"NOK"]
[3890000,{"$f":"A13-'via Einkommen'!$C$8","v":3690000},0.94858611825192807,166050,74840,27230,268120,{"$f":"+'via Einkommen'!$C$7*'via Einkommen'!$P$6","v":52500},"NOK",{"$f":"A13-'via Einkommen'!$C$8-K13","v":3690000},{"$f":"A13/100*'via Einkommen'!$C$9","v":0},166050,0,268120,"NOK"]
[3880000,{"$f":"A14-'via Einkommen'!$C$8","v":3680000},0.94845360824742264,165600,74613.333333333328,27160,267373.33333333331,{"$f":"+'via Einkommen'!$C$7*'via Einkommen'!$P$6","v":52500},"NOK",{"$f":"A14-'via Einkommen'!$C$8-K14","v":3680000},{"$f":"A14/100*'via Einkommen'!$C$9","v":0},165600,0,267373.33333333331,"NOK"]
[3870000,{"$f":"A15-'via Einkommen'!$C$8","v":3670000},0.94832041343669249,165150,74386.666666666672,27090,266626.66666666669,{"$f":"+'via Einkommen'!$C$7*'via Einkommen'!$P$6","v":52500},"NOK",{"$f":"A15-'via Einkommen'!$C$8-K15","v":3670000},{"$f":"A15/100*'via Einkommen'!$C$9","v":0},165150,0,266626.66666666669,"NOK"]
[3860000,{"$f":"A16-'via Einkommen'!$C$8","v":3660000},0.94818652849740936,164700,74160,27020,265880,{"$f":"+'via Einkommen'!$C$7*'via Einkommen'!$P$6","v":52500},"NOK",{"$f":"A16-'via Einkommen'!$C$8-K16","v":3660000},{"$f":"A16/100*'via Einkommen'!$C$9","v":0},164700,0,265880,"NOK"]
[3850000,{"$f":"A17-'via Einkommen'!$C$8","v":3650000},0.94805194805194803,164250,73933.333333333328,26950,265133.33333333331,{"$f":"+'via Einkommen'!$C$7*'via Einkommen'!$P$6","v":52500},"NOK",{"$f":"A17-'via Einkommen'!$C$8-K17","v":3650000},{"$f":"A17/100*'via Einkommen'!$C$9","v":0},164250,0,265133.33333333331,"NOK"]
[3840000,{"$f":"A18-'via Einkommen'!$C$8","v":3640000},0.94791666666666663,163800,73706.666666666672,26880,264386.66666666669,{"$f":"+'via Einkommen'!$C$7*'via Einkommen'!$P$6","v":52500},"NOK",{"$f":"A18-'via Einkommen'!$C$8-K18","v":3640000},{"$f":"A18/100*'via Einkommen'!$C$9","v":0},163800,0,264386.66666666669,"NOK"]
[3830000,{"$f":"A19-'via Einkommen'!$C$8","v":3630000},0.9477806788511749,163350,73480,26810,263640,{"$f":"+'via Einkommen'!$C$7*'via Einkommen'!$P$6","v":52500},"NOK",{"$f":"A19-'via Einkommen'!$C$8-K19","v":3630000},{"$f":"A19/100*'via Einkommen'!$C$9","v":0},163350,0,263640,"NOK"]
[3820000,{"$f":"A20-'via Einkommen'!$C$8","v":3620000},0.94764397905759157,162900,73253.333333333328,26740,262893.33333333331,{"$f":"+'via Einkommen'!$C$7*'via Einkommen'!$P$6","v":52500},"NOK",{"$f":"A20-'via Einkommen'!$C$8-K20","v":3620000},{"$f":"A20/100*'via Einkommen'!$C$9","v":0},162900,0,262893.33333333331,"NOK"]
[3810000,{"$f":"A21-'via Einkommen'!$C$8","v":3610000},0.94750656167978997,162450,73026.666666666672,26670,262146.66666666669,{"$f":"+'via Einkommen'!$C$7*'via Einkommen'!$P$6","v":52500},"NOK",{"$f":"A21-'via Einkommen'!$C$8-K21","v":3610000},{"$f":"A21/100*'via Einkommen'!$C$9","v":0},162450,0,262146.66666666669,"NOK"]
[3800000,{"$f":"A22-'via Einkommen'!$C$8","v":3600000},0.94736842105263153,162000,72800,26600,261400,{"$f":"+'via Einkommen'!$C$7*'via Einkommen'!$P$6","v":52500},"NOK",{"$f":"A22-'via Einkommen'!$C$8-K22","v":3600000},{"$f":"A22/100*'via Einkommen'!$C$9","v":0},162000,0,261400,"NOK"]
[3790000,{"$f":"A23-'via Einkommen'!$C$8","v":3590000},0.94722955145118737,161550,72573.333333333328,26530,260653.33333333331,{"$f":"+'via Einkommen'!$C$7*'via Einkommen'!$P$6","v":52500},"NOK",{"$f":"A23-'via Einkommen'!$C$8-K23","v":3590000},{"$f":"A23/100*'via Einkommen'!$C$9","v":0},161550,0,260653.33333333331,"NOK"]
[3780000,{"$f":"A24-'via Einkommen'!$C$8","v":3580000},0.94708994708994709,161100,72346.666666666672,26460,259906.66666666669,{"$f":"+'via Einkommen'!$C$7*'via Einkommen'!$P$6","v":52500},"NOK",{"$f":"A24-'via Einkommen'!$C$8-K24","v":3580000},{"$f":"A24/100*'via Einkommen'!$C$9","v":0},161100,0,259906.66666666669,"NOK"]
[3770000,{"$f":"A25-'via Einkommen'!$C$8","v":3570000},0.94694960212201595,160650,72120,26390,259160,{"$f":"+'via Einkommen'!$C$7*'via Einkommen'!$P$6","v":52500},"NOK",{"$f":"A25-'via Einkommen'!$C$8-K25","v":3570000},{"$f":"A25/100*'via Einkommen'!$C$9","v":0},160650,0,259160,"NOK"]
[3760000,{"$f":"A26-'via Einkommen'!$C$8","v":3560000},0.94680851063829785,160200,71893.333333333328,26320,258413.33333333331,{"$f":"+'via Einkommen'!$C$7*'via Einkommen'!$P$6","v":52500},"NOK",{"$f":"A26-'via Einkommen'!$C$8-K26","v":3560000},{"$f":"A26/100*'via Einkommen'!$C$9","v":0},160200,0,258413.33333333331,"NOK"]
[3750000,{"$f":"A27-'via Einkommen'!$C$8","v":3550000},0.94666666666666666,159750,71666.666666666672,26250,257666.66666666669,{"$f":"+'via Einkommen'!$C$7*'via Einkommen'!$P$6","v":52500},"NOK",{"$f":"A27-'via Einkommen'!$C$8-K27","v":3550000},{"$f":"A27/100*'via Einkommen'!$C$9","v":0},159750,0,257666.66666666669,"NOK"]
[3740000,{"$f":"A28-'via Einkommen'!$C$8","v":3540000},0.946524064171123,159300,71440,26180,256920,{"$f":"+'via Einkommen'!$C$7*'via Einkommen'!$P$6","v":52500},"NOK",{"$f":"A28-'via Einkommen'!$C$8-K28","v":3540000},{"$f":"A28/100*'via Einkommen'!$C$9","v":0},159300,0,256920,"NOK"]
[3730000,{"$f":"A29-'via Einkommen'!$C$8","v":3530000},0.9463806970509383,158850,71213.333333333328,26110,256173.33333333331,{"$f":"+'via Einkommen'!$C$7*'via Einkommen'!$P$6","v":52500},"NOK",{"$f":"A29-'via Einkommen'!$C$8-K29","v":3530000},{"$f":"A29/100*'via Einkommen'!$C$9","v":0},158850,0,256173.33333333331,"NOK"]
[3720000,{"$f":"A30-'via Einkommen'!$C$8","v":3520000},0.94623655913978499,158400,70986.666666666672,26040,255426.66666666669,{"$f":"+'via Einkommen'!$C$7*'via Einkommen'!$P$6","v":52500},"NOK",{"$f":"A30-'via Einkommen'!$C$8-K30","v":3520000},{"$f":"A30/100*'via Einkommen'!$C$9","v":0},158400,0,255426.66666666669,"NOK"]
[3710000,{"$f":"A31-'via Einkommen'!$C$8","v":3510000},0.9460916442048517,157950,70760,25970,254680,{"$f":"+'via Einkommen'!$C$7*'via Einkommen'!$P$6","v":52500},"NOK",{"$f":"A31-'via Einkommen'!$C$8-K31","v":3510000},{"$f":"A31/100*'via Einkommen'!$C$9","v":0},157950,0,254680,"NOK"]
[3700000,{"$f":"A32-'via Einkommen'!$C$8","v":3500000},0.94594594594594594,157500,70533.333333333328,25900,253933.33333333331,{"$f":"+'via Einkommen'!$C$7*'via Einkommen'!$P$6","v":52500},"NOK",{"$f":"A32-'via Einkommen'!$C$8-K32","v":3500000},{"$f":"A32/100*'via Einkommen'!$C$9","v":0},157500,0,253933.33333333331,"NOK"]
[3690000,{"$f":"A33-'via Einkommen'!$C$8","v":3490000},0.94579945799457998,157050,70306.666666666672,25830,253186.66666666669,{"$f":"+'via Einkommen'!$C$7*'via Einkommen'!$P$6","v":52500},"NOK",{"$f":"A33-'via Einkommen'!$C$8-K33","v":3490000},{"$f":"A33/100*'via Einkommen'!$C$9","v":0},157050,0,253186.66666666669,"NOK"]
[3680000,{"$f":"A34-'via Einkommen'!$C$8","v":3480000},0.94565217391304346,156600,70080,25760,252440,{"$f":"+'via Einkommen'!$C$7*'via Einkommen'!$P$6","v":52500},"NOK",{"$f":"A34-'via Einkommen'!$C$8-K34","v":3480000},{"$f":"A34/100*'via Einkommen'!$C$9","v":0},156600,0,252440,"NOK"]
[3670000,{"$f":"A35-'via Einkommen'!$C$8","v":3470000},0.94550408719346046,156150,69853.333333333328,25690,251693.33333333331,{"$f":"+'via Einkommen'!$C$7*'via Einkommen'!$P$6","v":52500},"NOK",{"$f":"A35-'via Einkommen'!$C$8-K35","v":3470000},{"$f":"A35/100*'via Einkommen'!$C$9","v":0},156150,0,251693.33333333331,"NOK"]
[3660000,{"$f":"A36-'via Einkommen'!$C$8","v":3460000},0.94535519125683065,155700,69626.666666666672,25620,250946.66666666669,{"$f":"+'via Einkommen'!$C$7*'via Einkommen'!$P$6","v":52500},"NOK",{"$f":"A36-'via Einkommen'!$C$8-K36","v":3460000},{"$f":"A36/100*'via Einkommen'!$C$9","v":0},155700,0,250946.66666666669,"NOK"]
[3650000,{"$f":"A37-'via Einkommen'!$C$8","v":3450000},0.9452054794520548,155250,69400,25550,250200,{"$f":"+'via Einkommen'!$C$7*'via Einkommen'!$P$6","v":52500},"NOK",{"$f":"A37-'via Einkommen'!$C$8-K37","v":3450000},{"$f":"A37/100*'via Einkommen'!$C$9","v":0},155250,0,250200,"NOK"]
[3640000,{"$f":"A38-'via Einkommen'!$C$8","v":3440000},0.94505494505494503,154800,69173.333333333328,25480,249453.33333333331,{"$f":"+'via Einkommen'!$C$7*'via Einkommen'!$P$6","v":52500},"NOK",{"$f":"A38-'via Einkommen'!$C$8-K38","v":3440000},{"$f":"A38/100*'via Einkommen'!$C$9","v":0},154800,0,249453.33333333331,"NOK"]
[3630000,{"$f":"A39-'via Einkommen'!$C$8","v":3430000},0.94490358126721763,154350,68946.666666666672,25410,248706.66666666669,{"$f":"+'via Einkommen'!$C$7*'via Einkommen'!$P$6","v":52500},"NOK",{"$f":"A39-'via Einkommen'!$C$8-K39","v":3430000},{"$f":"A39/100*'via Einkommen'!$C$9","v":0},154350,0,248706.66666666669,"NOK"]
[3620000,{"$f":"A40-'via Einkommen'!$C$8","v":3420000},0.94475138121546964,153900,68720,25340,247960,{"$f":"+'via Einkommen'!$C$7*'via Einkommen'!$P$6","v":52500},"NOK",{"$f":"A40-'via Einkommen'!$C$8-K40","v":3420000},{"$f":"A40/100*'via Einkommen'!$C$9","v":0},153900,0,247960,"NOK"]
{"$rows_left_out":361}